BDBM50007271 CHEMBL101497::Sodium; 6-[2-(4-fluoro-phenyl)-4-isopropyl-quinolin-3-yloxy]-3,5-dihydroxy-hexanoate
SMILES CC(C)c1c(OCC(O)C[C@@H](O)CC([O-])=O)c(nc2ccccc12)-c1ccc(F)cc1
InChI Key InChIKey=WFJBUGLKYOMEIA-QNSVNVJESA-M
Data  2 IC50
  Tab Delimited (TSV)   2D SDfile   Computed 3D by Vconf -m prep SDfile
Find this compound or compounds like it in BindingDB:
Activity Spreadsheet -- Enzyme Inhibition Constant Data from BindingDB
Found 2 hits for monomerid = 50007271
Target3-hydroxy-3-methylglutaryl-coenzyme A reductase(Homo sapiens (Human))
Hoechst
Curated by ChEMBL
LigandPNGBDBM50007271(CHEMBL101497 | Sodium; 6-[2-(4-fluoro-phenyl)-4-is...)
Affinity DataIC50:  250nM. Assay description: Inhibition of the incorporation of sodium [14C]acetate into cholesterol in HEP G2 cells.
In DepthDetails ArticlePubMed
Target3-hydroxy-3-methylglutaryl-coenzyme A reductase(Rattus norvegicus (rat))
Hoechst
Curated by ChEMBL
LigandPNGBDBM50007271(CHEMBL101497 | Sodium; 6-[2-(4-fluoro-phenyl)-4-is...)
Affinity DataIC50:  50nM. Assay description: In vitro inhibition of HMG-CoA reductase in solubilized rat liver.
In DepthDetails ArticlePubMed